Target
cAMP-specific 3',5'-cyclic phosphodiesterase 4B
Ligand
BDBM50085135
Substrate
Meas. Tech.
ChEMBL_155173 (CHEMBL761911)
IC50
49±n/a nM
Citation
 Hersperger, RBray-French, KMazzoni, LMüller, T Palladium-catalyzed cross-coupling reactions for the synthesis of 6, 8-disubstituted 1,7-naphthyridines: a novel class of potent and selective phosphodiesterase type 4D inhibitors. J Med Chem 43:675-82 (2000)  
Target
Name:
cAMP-specific 3',5'-cyclic phosphodiesterase 4B
Synonyms:
DPDE4 Pde4b | Phosphodiesterase 4B
Type:
Enzyme Catalytic Domain
Mol. Mass.:
83349.50
Organism:
RAT
Description:
P14646
Residue:
736
  
Inhibitor
Name:
BDBM50085135
Synonyms:
4-(8-(3-nitrophenyl)-1,7-naphthyridin-6-yl)benzoic acid 4-[8-(3-nitrophenyl)-1,7-naphthyridin-6-yl]benzoic acid | CHEMBL74078
Type:
Small organic molecule
Emp. Form.:
C21H13N3O4
Mol. Mass.:
371.3456
SMILES:
OC(=O)c1ccc(cc1)-c1cc2cccnc2c(n1)-c1cccc(c1)[N+]([O-])=O
: