Target
Polyunsaturated fatty acid 5-lipoxygenase
Ligand
BDBM50085159
Substrate
Meas. Tech.
ChEMBL_86312 (CHEMBL696464)
IC50
15±n/a nM
Citation
 Kolasa, TGunn, DEBhatia, PWoods, KWGane, TStewart, AOBouska, JBHarris, RRHulkower, KIMalo, PEBell, RLCarter, GWBrooks, CD Heteroarylmethoxyphenylalkoxyiminoalkylcarboxylic acids as leukotriene biosynthesis inhibitors. J Med Chem 43:690-705 (2000)  
Target
Name:
Polyunsaturated fatty acid 5-lipoxygenase
Synonyms:
5-LO 5-Lipoxygenase (5-LO) 5-Lipoygenase ALOX5 LOG5 | LOX5_HUMAN
Type:
Enzyme
Mol. Mass.:
77972.74
Organism:
Homo sapiens (Human)
Description:
Recombinant protein was purified from E. coli lysate. After ammonium sulfate precipitation and subsequent steps, the supernatant (S100) was used for 5-LO activity assay.
Residue:
674
  
Inhibitor
Name:
BDBM50085159
Synonyms:
2-{Cyclohexyl-[4-(quinolin-2-ylmethoxy)-phenyl]-methoxyimino}-propionic acid R-E-2-{Cyclohexyl-[4-(quinolin-2-ylmethoxy)-phenyl]-methoxyimino}-propionic acid RS-E/Z-2-{Cyclohexyl-[4-(quinolin-2-ylmethoxy)-phenyl]-methoxyimino}-propionic acid S-E-2-{Cyclohexyl-[4-(quinolin-2-ylmethoxy)-phenyl]-methoxyimino}-propionic acid
Type:
Small organic molecule
Emp. Form.:
C26H28N2O4
Mol. Mass.:
432.5115
SMILES:
C\C(=N/OC(C1CCCCC1)c1ccc(OCc2ccc3ccccc3n2)cc1)C(O)=O
: