Target
Aldo-keto reductase family 1 member B1
Ligand
BDBM50038843
Substrate
Meas. Tech.
ChEMBL_31330 (CHEMBL644883)
IC50
72.60±n/a nM
Citation
 Singh, SBMalamas, MSHohman, TCNilakantan, RCarper, DAKitchen, D Molecular modeling of the aldose reductase-inhibitor complex based on the X-ray crystal structure and studies with single-site-directed mutants. J Med Chem 43:1062-70 (2000)  
Target
Name:
Aldo-keto reductase family 1 member B1
Synonyms:
AKR1B1 ALDR_HUMAN AR Aldose Reductase (ALR2) Aldose reductase (AR)
Type:
Protein
Mol. Mass.:
35855.50
Organism:
Homo sapiens (Human)
Description:
P15121. 4LAU; 2IKI; 4LB4; 2FZD; 2FZ8; 1US0
Residue:
316
  
Inhibitor
Name:
BDBM50038843
Synonyms:
(4R)-2-(4-bromo-2-fluorobenzyl)-6-fluoro-1H,2'H,5'H-spiro[isoquinoline-4,3'-pyrrolidine]-1,2',3,5'(2H)-tetrone 2-(4-bromo-2-fluorobenzyl)-6-fluoro-1H,2'H,5'H-spiro[isoquinoline-4,3'-pyrrolidine]-1,2',3,5'(2H)-tetrone 2[4-BROMO-2-FLUOROPHENYL)METHYL]-6-FLUOROSPIRO[ISOQUINOLINE-4-(1H),3'-PYRROLIDINE]-1,2',3,5'(2H)-TETRONE minalrestat
Type:
Small organic molecule
Emp. Form.:
C19H11BrF2N2O4
Mol. Mass.:
449.202
SMILES:
Fc1ccc2C(=O)N(Cc3ccc(Br)cc3F)C(=O)[C@]3(CC(=O)NC3=O)c2c1
: