Target
Muscarinic acetylcholine receptor M1
Ligand
BDBM50107330
Substrate
Meas. Tech.
ChEMBL_138951 (CHEMBL745931)
Ki
575.5±n/a nM
Citation
 Robarge, MJAgoston, GEIzenwasser, SKopajtic, TGeorge, CKatz, JLNewman, AH Highly selective chiral N-substituted 3alpha-[bis(4'-fluorophenyl)methoxy]tropane analogues for the dopamine transporter: synthesis and comparative molecular field analysis. J Med Chem 43:1085-93 (2000)  
Target
Name:
Muscarinic acetylcholine receptor M1
Synonyms:
ACM1_RAT Chrm-1 cholinergic receptor, muscarinic 1
Type:
Enzyme Catalytic Domain
Mol. Mass.:
51390.46
Organism:
RAT
Description:
P08482
Residue:
460
  
Inhibitor
Name:
BDBM50107330
Synonyms:
3-[Bis-(4-fluoro-phenyl)-methoxy]-8-(4-phenyl-butyl)-8-aza-bicyclo[3.2.1]octane | CHEMBL137884
Type:
Small organic molecule
Emp. Form.:
C30H33F2NO
Mol. Mass.:
461.5859
SMILES:
Fc1ccc(cc1)C(OC1CC2CCC(C1)N2CCCCc1ccccc1)c1ccc(F)cc1
: