Target
Sodium-dependent dopamine transporter
Ligand
BDBM50086049
Substrate
Meas. Tech.
ChEMBL_62493 (CHEMBL677550)
Ki
367±n/a nM
Citation
 Robarge, MJAgoston, GEIzenwasser, SKopajtic, TGeorge, CKatz, JLNewman, AH Highly selective chiral N-substituted 3alpha-[bis(4'-fluorophenyl)methoxy]tropane analogues for the dopamine transporter: synthesis and comparative molecular field analysis. J Med Chem 43:1085-93 (2000)  
Target
Name:
Sodium-dependent dopamine transporter
Synonyms:
DA transporter SC6A3_RAT Sodium-dependent dopamine transporter | Sodium-dependent dopamine transporter (DAT)
Type:
Multi-pass membrane protein
Mol. Mass.:
68749.45
Organism:
Rattus norvegicus (rat)
Description:
P23977
Residue:
619
  
Inhibitor
Name:
BDBM50086049
Synonyms:
3-[Bis-(4-fluoro-phenyl)-methoxy]-8-naphthalen-1-ylmethyl-8-aza-bicyclo[3.2.1]octane | CHEMBL12004
Type:
Small organic molecule
Emp. Form.:
C31H29F2NO
Mol. Mass.:
469.5649
SMILES:
Fc1ccc(cc1)C(OC1CC2CCC(C1)N2Cc1cccc2ccccc12)c1ccc(F)cc1
: