Target
Kappa-type opioid receptor
Ligand
BDBM50087002
Substrate
Meas. Tech.
ChEMBL_145260 (CHEMBL751038)
Ki
46±n/a nM
Citation
 Röver, SAdam, GCesura, AMGalley, GJenck, FMonsma, FJWichmann, JDautzenberg, FM High-affinity, non-peptide agonists for the ORL1 (orphanin FQ/nociceptin) receptor. J Med Chem 43:1329-38 (2001)  
Target
Name:
Kappa-type opioid receptor
Synonyms:
K-OR-1 Kappa-opioid receptor (KOR) Kappa-type opioid receptor (KOR) OPIATE Kappa OPRK1 kappa opioid receptor (KOR)
Type:
G Protein-Coupled Receptor (GPCR)
Mol. Mass.:
42648.76
Organism:
Homo sapiens (Human)
Description:
P41145
Residue:
380
  
Inhibitor
Name:
BDBM50087002
Synonyms:
1-Phenyl-8-(1,2,3,4-tetrahydro-naphthalen-1-yl)-1,3,8-triaza-spiro[4.5]decan-4-one | CHEMBL27716
Type:
Small organic molecule
Emp. Form.:
C23H27N3O
Mol. Mass.:
361.48
SMILES:
O=C1NCN(c2ccccc2)C11CCN(CC1)[C@@H]1CCCc2ccccc12
: