Target
Mu-type opioid receptor
Ligand
BDBM50087009
Substrate
Meas. Tech.
ChEMBL_148232 (CHEMBL753392)
Ki
7.5±n/a nM
Citation
 Röver, SAdam, GCesura, AMGalley, GJenck, FMonsma, FJWichmann, JDautzenberg, FM High-affinity, non-peptide agonists for the ORL1 (orphanin FQ/nociceptin) receptor. J Med Chem 43:1329-38 (2001)  
Target
Name:
Mu-type opioid receptor
Synonyms:
M-OR-1 MOR-1 MUOR1 Mu opiate receptor OPRM1 hMOP | mu-type opioid receptor isoform MOR-1
Type:
G Protein-Coupled Receptor (GPCR)
Mol. Mass.:
44789.51
Organism:
Homo sapiens (Human)
Description:
P35372
Residue:
400
  
Inhibitor
Name:
BDBM50087009
Synonyms:
8-(8-Chloro-1,2,3,4-tetrahydro-naphthalen-2-yl)-3-methoxymethyl-1-phenyl-1,3,8-triaza-spiro[4.5]decan-4-one | CHEMBL283432
Type:
Small organic molecule
Emp. Form.:
C25H30ClN3O2
Mol. Mass.:
439.978
SMILES:
COCN1CN(c2ccccc2)C2(CCN(CC2)C2CCc3cccc(Cl)c3C2)C1=O
: