Target
Kappa-type opioid receptor
Ligand
BDBM50087019
Substrate
Meas. Tech.
ChEMBL_145260 (CHEMBL751038)
Ki
47±n/a nM
Citation
 Röver, SAdam, GCesura, AMGalley, GJenck, FMonsma, FJWichmann, JDautzenberg, FM High-affinity, non-peptide agonists for the ORL1 (orphanin FQ/nociceptin) receptor. J Med Chem 43:1329-38 (2001)  
Target
Name:
Kappa-type opioid receptor
Synonyms:
K-OR-1 Kappa-opioid receptor (KOR) Kappa-type opioid receptor (KOR) OPIATE Kappa OPRK1 kappa opioid receptor (KOR)
Type:
G Protein-Coupled Receptor (GPCR)
Mol. Mass.:
42648.76
Organism:
Homo sapiens (Human)
Description:
P41145
Residue:
380
  
Inhibitor
Name:
BDBM50087019
Synonyms:
8-(5,8-Dichloro-1,2,3,4-tetrahydro-naphthalen-2-yl)-1-phenyl-1,3,8-triaza-spiro[4.5]decan-4-one | CHEMBL418020
Type:
Small organic molecule
Emp. Form.:
C23H25Cl2N3O
Mol. Mass.:
430.37
SMILES:
Clc1ccc(Cl)c2C[C@@H](CCc12)N1CCC2(CC1)N(CNC2=O)c1ccccc1
: