Target
Mu-type opioid receptor
Ligand
BDBM50027473
Substrate
Meas. Tech.
ChEMBL_148232 (CHEMBL753392)
Ki
0.140000±n/a nM
Citation
 Röver, SAdam, GCesura, AMGalley, GJenck, FMonsma, FJWichmann, JDautzenberg, FM High-affinity, non-peptide agonists for the ORL1 (orphanin FQ/nociceptin) receptor. J Med Chem 43:1329-38 (2001)  
Target
Name:
Mu-type opioid receptor
Synonyms:
M-OR-1 MOR-1 MUOR1 Mu opiate receptor OPRM1 hMOP | mu-type opioid receptor isoform MOR-1
Type:
G Protein-Coupled Receptor (GPCR)
Mol. Mass.:
44789.51
Organism:
Homo sapiens (Human)
Description:
P35372
Residue:
400
  
Inhibitor
Name:
BDBM50027473
Synonyms:
3-Methyl-1-phenethyl-4-(phenyl-propionyl-amino)-piperidine-4-carboxylic acid methyl ester CHEMBL28198
Type:
Small organic molecule
Emp. Form.:
C25H32N2O3
Mol. Mass.:
408.5332
SMILES:
CCC(=O)N(c1ccccc1)[C@]1(CCN(CCc2ccccc2)C[C@H]1C)C(=O)OC
: