Target
Nociceptin receptor
Ligand
BDBM50087021
Substrate
Meas. Tech.
ChEMBL_146118 (CHEMBL754587)
Ki
10±n/a nM
Citation
 Röver, SAdam, GCesura, AMGalley, GJenck, FMonsma, FJWichmann, JDautzenberg, FM High-affinity, non-peptide agonists for the ORL1 (orphanin FQ/nociceptin) receptor. J Med Chem 43:1329-38 (2001)  
Target
Name:
Nociceptin receptor
Synonyms:
KOR-3 Mu-type opioid receptor (Mu) Nociceptin Receptor (ORL1 Receptor) Nociceptin receptor (ORL-1) Nociceptin/Orphanin FQ, NOP receptor OPIATE ORL-1 OPRL1 protein ORL1 Opioid receptor like-1 Orphanin FQ receptor (ORL1) | P41146
Type:
G Protein-Coupled Receptor (GPCR)
Mol. Mass.:
40702.87
Organism:
Homo sapiens (Human)
Description:
P41146
Residue:
370
  
Inhibitor
Name:
BDBM50087021
Synonyms:
1-Phenyl-8-(1,2,3,4-tetrahydro-naphthalen-1-yl)-1,3,8-triaza-spiro[4.5]decan-4-one | CHEMBL26638
Type:
Small organic molecule
Emp. Form.:
C23H27N3O
Mol. Mass.:
361.48
SMILES:
O=C1NCN(c2ccccc2)C11CCN(CC1)[C@H]1CCCc2ccccc12
: