Target
Mu-type opioid receptor
Ligand
BDBM50087013
Substrate
Meas. Tech.
ChEMBL_148233 (CHEMBL753393)
Ki
15±n/a nM
Citation
 Röver, SAdam, GCesura, AMGalley, GJenck, FMonsma, FJWichmann, JDautzenberg, FM High-affinity, non-peptide agonists for the ORL1 (orphanin FQ/nociceptin) receptor. J Med Chem 43:1329-38 (2001)  
Target
Name:
Mu-type opioid receptor
Synonyms:
M-OR-1 MOR-1 MUOR1 Mu opiate receptor OPRM1 hMOP | mu-type opioid receptor isoform MOR-1
Type:
G Protein-Coupled Receptor (GPCR)
Mol. Mass.:
44789.51
Organism:
Homo sapiens (Human)
Description:
P35372
Residue:
400
  
Inhibitor
Name:
BDBM50087013
Synonyms:
1-Phenyl-8-(1,2,3,4-tetrahydro-naphthalen-2-yl)-1,3,8-triaza-spiro[4.5]decan-4-one | CHEMBL26999
Type:
Small organic molecule
Emp. Form.:
C23H27N3O
Mol. Mass.:
361.48
SMILES:
O=C1NCN(c2ccccc2)C11CCN(CC1)C1CCc2ccccc2C1
: