Target
Sodium/glucose cotransporter 1
Ligand
BDBM50422352
Substrate
Meas. Tech.
ChEMBL_202730 (CHEMBL809058)
Ki
21600±n/a nM
Citation
 Wielert-Badt, SLin, JTLorenz, MFritz, SKinne, RK Probing the conformation of the sugar transport inhibitor phlorizin by 2D-NMR, molecular dynamics studies, and pharmacophore analysis. J Med Chem 43:1692-8 (2000)  
Target
Name:
Sodium/glucose cotransporter 1
Synonyms:
High affinity sodium-glucose cotransporter Na(+)/glucose cotransporter 1 SGLT1 Sodium-dependent glucose cotransporter 1 (SGLT1) Sodium/glucose cotransporter 1 (SGLT1) | Solute carrier family 5 member 1
Type:
Protein
Mol. Mass.:
73503.78
Organism:
Homo sapiens (Human)
Description:
P13866
Residue:
664
  
Inhibitor
Name:
BDBM50422352
Synonyms:
CHEMBL2303990
Type:
Small organic molecule
Emp. Form.:
C21H23NO12
Mol. Mass.:
481.4068
SMILES:
OC[C@@H]1O[C@@H](Oc2cc(O)cc(O)c2C(=O)CCc2ccc(O)c(c2)[N+]([O-])=O)[C@@H](O)[C@@H](O)[C@@H]1O
: