Target
Protein kinase C alpha type
Ligand
BDBM50087240
Substrate
Meas. Tech.
ChEMBL_153127 (CHEMBL759066)
Ki
87.20±n/a nM
Citation
 Nacro, KSigano, DMYan, SNicklaus, MCPearce, LLLewin, NEGarfield, SHBlumberg, PMMarquez, VE An optimized protein kinase C activating diacylglycerol combining high binding affinity (Ki) with reduced lipophilicity (log P). J Med Chem 44:1892-904 (2001)  
Target
Name:
Protein kinase C alpha type
Synonyms:
KPCA_BOVIN PRKCA Protein kinase C alpha
Type:
Enzyme
Mol. Mass.:
76842.76
Organism:
Bos taurus (bovine)
Description:
Residue:
672
  
Inhibitor
Name:
BDBM50087240
Synonyms:
(E)-Octadec-9-enoic acid (S)-1-hydroxymethyl-2-((E)-octadec-9-enoyloxy)-ethyl ester Octadec-9-enoic acid 1-hydroxymethyl-2-octadec-9-enoyloxy-ethyl ester(DIOLEIN)
Type:
Small organic molecule
Emp. Form.:
C39H72O5
Mol. Mass.:
620.986
SMILES:
CCCCCCCC\C=C\CCCCCCCC(=O)OC[C@H](CO)OC(=O)CCCCCCC\C=C\CCCCCCCC
: