Target
Thymidylate synthase
Ligand
BDBM18796
Substrate
Meas. Tech.
ChEMBL_208758 (CHEMBL812312)
IC50
1100±n/a nM
Citation
 Gangjee, AVidwans, AElzein, EMcGuire, JJQueener, SFKisliuk, RL Synthesis, antifolate, and antitumor activities of classical and nonclassical 2-amino-4-oxo-5-substituted-pyrrolo[2,3-d]pyrimidines. J Med Chem 44:1993-2003 (2001)  
Target
Name:
Thymidylate synthase
Synonyms:
TS Thymidylate Synthase (TS) thyA
Type:
Mol. Mass.:
30487.86
Organism:
Escherichia coli
Description:
Residue:
264
  
Inhibitor
Name:
BDBM18796
Synonyms:
(2S)-2-{[4-(2-{2-amino-4-oxo-1H,4H,7H-pyrrolo[2,3-d]pyrimidin-5-yl}ethyl)phenyl]formamido}pentanedioic acid Pemetrexed
Type:
Small organic molecule
Emp. Form.:
C20H21N5O6
Mol. Mass.:
427.4106
SMILES:
Nc1nc2[nH]cc(CCc3ccc(cc3)C(=O)N[C@@H](CCC(O)=O)C(O)=O)c2c(=O)[nH]1
: