Target
Glyceraldehyde-3-phosphate dehydrogenase, cytosolic
Ligand
BDBM50100480
Substrate
Meas. Tech.
ChEMBL_72768 (CHEMBL680373)
IC50
60000±n/a nM
Citation
 Bressi, JCVerlinde, CLAronov, AMShaw, MLShin, SSNguyen, LNSuresh, SBuckner, FSVan Voorhis, WCKuntz, IDHol, WGGelb, MH Adenosine analogues as selective inhibitors of glyceraldehyde-3-phosphate dehydrogenase of Trypanosomatidae via structure-based drug design. J Med Chem 44:2080-93 (2001)  
Target
Name:
Glyceraldehyde-3-phosphate dehydrogenase, cytosolic
Synonyms:
G3PC_LEIME GAPDH Glyceraldehyde-3-phosphate dehydrogenase, cytosolic
Type:
PROTEIN
Mol. Mass.:
35645.40
Organism:
Leishmania mexicana
Description:
ChEMBL_72768
Residue:
331
  
Inhibitor
Name:
BDBM50100480
Synonyms:
CHEMBL65287 | N-[2-(6-Amino-purin-9-ylmethyl)-5-diphenylacetylamino-4-hydroxy-tetrahydro-furan-3-yl]-3,5-dimethoxy-benzamide
Type:
Small organic molecule
Emp. Form.:
C34H35N7O6
Mol. Mass.:
637.685
SMILES:
COc1cc(OC)cc(c1)C(=O)N[C@@H]1C(Cn2cnc3c(N)ncnc23)OC(CNC(=O)C(c2ccccc2)c2ccccc2)[C@@H]1O
: