Target
Glyceraldehyde-3-phosphate dehydrogenase, cytosolic
Ligand
BDBM50096600
Substrate
Meas. Tech.
ChEMBL_72768 (CHEMBL680373)
IC50
6000±n/a nM
Citation
 Bressi, JCVerlinde, CLAronov, AMShaw, MLShin, SSNguyen, LNSuresh, SBuckner, FSVan Voorhis, WCKuntz, IDHol, WGGelb, MH Adenosine analogues as selective inhibitors of glyceraldehyde-3-phosphate dehydrogenase of Trypanosomatidae via structure-based drug design. J Med Chem 44:2080-93 (2001)  
Target
Name:
Glyceraldehyde-3-phosphate dehydrogenase, cytosolic
Synonyms:
G3PC_LEIME GAPDH Glyceraldehyde-3-phosphate dehydrogenase, cytosolic
Type:
PROTEIN
Mol. Mass.:
35645.40
Organism:
Leishmania mexicana
Description:
ChEMBL_72768
Residue:
331
  
Inhibitor
Name:
BDBM50096600
Synonyms:
CHEMBL464924 N-((2R,3R,4S,5R)-4-hydroxy-5-(hydroxymethyl)-2-(6-(naphthalen-1-ylmethylamino)-9H-purin-9-yl)tetrahydrofuran-3-yl)-3-methoxybenzamide | N-(4-Hydroxy-5-hydroxymethyl-2-{6-[(naphthalen-1-ylmethyl)-amino]-9H-purin-3-ylmethyl}-tetrahydro-furan-3-yl)-3-methoxy-benzamide
Type:
Small organic molecule
Emp. Form.:
C29H28N6O5
Mol. Mass.:
540.5698
SMILES:
COc1cccc(c1)C(=O)N[C@@H]1[C@H](O)[C@@H](CO)O[C@H]1n1cnc2c(NCc3cccc4ccccc34)ncnc12
: