Target
Glyceraldehyde-3-phosphate dehydrogenase, cytosolic
Ligand
BDBM50100493
Substrate
Meas. Tech.
ChEMBL_72768 (CHEMBL680373)
IC50
25000±n/a nM
Citation
 Bressi, JCVerlinde, CLAronov, AMShaw, MLShin, SSNguyen, LNSuresh, SBuckner, FSVan Voorhis, WCKuntz, IDHol, WGGelb, MH Adenosine analogues as selective inhibitors of glyceraldehyde-3-phosphate dehydrogenase of Trypanosomatidae via structure-based drug design. J Med Chem 44:2080-93 (2001)  
Target
Name:
Glyceraldehyde-3-phosphate dehydrogenase, cytosolic
Synonyms:
G3PC_LEIME GAPDH Glyceraldehyde-3-phosphate dehydrogenase, cytosolic
Type:
PROTEIN
Mol. Mass.:
35645.40
Organism:
Leishmania mexicana
Description:
ChEMBL_72768
Residue:
331
  
Inhibitor
Name:
BDBM50100493
Synonyms:
3,5-Dichloro-N-(4-hydroxy-5-hydroxymethyl-2-{6-[(naphthalen-2-ylmethyl)-amino]-purin-9-ylmethyl}-tetrahydro-furan-3-yl)-benzamide | CHEMBL65460
Type:
Small organic molecule
Emp. Form.:
C29H26Cl2N6O4
Mol. Mass.:
593.461
SMILES:
OCC1OC(Cn2cnc3c(NCc4ccc5ccccc5c4)ncnc23)[C@@H](NC(=O)c2cc(Cl)cc(Cl)c2)[C@H]1O
: