Target
Neutrophil collagenase
Ligand
BDBM50102477
Substrate
Meas. Tech.
ChEMBL_105068 (CHEMBL873369)
IC50
0.5±n/a nM
Citation
 Pikul, SOhler, NECiszewski, GLaufersweiler, MCAlmstead, NGDe, BNatchus, MGHsieh, LCJanusz, MJPeng, SXBranch, TMKing, SLTaiwo, YOMieling, GE Potent and selective carboxylic acid-based inhibitors of matrix metalloproteinases. J Med Chem 44:2499-502 (2001)  
Target
Name:
Neutrophil collagenase
Synonyms:
CLG1 MMP8 Matrix metalloproteinase-8 PMNL collagenase | PMNL-CL
Type:
Enzyme
Mol. Mass.:
53413.48
Organism:
Homo sapiens (Human)
Description:
P22894
Residue:
467
  
Inhibitor
Name:
BDBM50102477
Synonyms:
4-[Carboxy-(4'-methoxy-biphenyl-4-sulfonylamino)-methyl]-piperidine-1-carboxylic acid 2-methoxy-ethyl ester | CHEMBL311266
Type:
Small organic molecule
Emp. Form.:
C24H30N2O8S
Mol. Mass.:
506.569
SMILES:
COCCOC(=O)N1CCC(CC1)C(NS(=O)(=O)c1ccc(cc1)-c1ccc(OC)cc1)C(O)=O
: