Target
Interstitial collagenase
Ligand
BDBM50102630
Substrate
Meas. Tech.
ChEMBL_106154 (CHEMBL718850)
Ki
<1±n/a nM
Citation
 Xue, CBVoss, MENelson, DJDuan, JJCherney, RJJacobson, ICHe, XRoderick, JChen, LCorbett, RLWang, LMeyer, DTKennedy, KDeGradodagger, WFHardman, KDTeleha, CAJaffee, BDLiu, RQCopeland, RACovington, MBChrist, DDTrzaskos, JMNewton, RCMagolda, RLWexler, RRDecicco, CP Design, synthesis, and structure-activity relationships of macrocyclic hydroxamic acids that inhibit tumor necrosis factor alpha release in vitro and in vivo. J Med Chem 44:2636-60 (2001)  
Target
Name:
Interstitial collagenase
Synonyms:
CLG MMP1 Matrix metalloproteinase-1 | Matrix metalloproteinase-1 (MMP-1)
Type:
Enzyme
Mol. Mass.:
54010.26
Organism:
Homo sapiens (Human)
Description:
P03956
Residue:
469
  
Inhibitor
Name:
BDBM50102630
Synonyms:
11-Isobutyl-3-methyl-2,10-dioxo-1-oxa-3,9-diaza-cyclopentadecane-8,12-dicarboxylic acid 12-hydroxyamide 8-methylamide | CHEMBL88427
Type:
Small organic molecule
Emp. Form.:
C20H36N4O6
Mol. Mass.:
428.523
SMILES:
CNC(=O)[C@@H]1CCCCN(C)C(=O)OCCC[C@@H]([C@@H](CC(C)C)C(=O)N1)C(=O)NO
: