Target
Interstitial collagenase
Ligand
BDBM50102640
Substrate
Meas. Tech.
ChEMBL_106154 (CHEMBL718850)
Ki
1.4±n/a nM
Citation
 Xue, CBVoss, MENelson, DJDuan, JJCherney, RJJacobson, ICHe, XRoderick, JChen, LCorbett, RLWang, LMeyer, DTKennedy, KDeGradodagger, WFHardman, KDTeleha, CAJaffee, BDLiu, RQCopeland, RACovington, MBChrist, DDTrzaskos, JMNewton, RCMagolda, RLWexler, RRDecicco, CP Design, synthesis, and structure-activity relationships of macrocyclic hydroxamic acids that inhibit tumor necrosis factor alpha release in vitro and in vivo. J Med Chem 44:2636-60 (2001)  
Target
Name:
Interstitial collagenase
Synonyms:
CLG MMP1 Matrix metalloproteinase-1 | Matrix metalloproteinase-1 (MMP-1)
Type:
Enzyme
Mol. Mass.:
54010.26
Organism:
Homo sapiens (Human)
Description:
P03956
Residue:
469
  
Inhibitor
Name:
BDBM50102640
Synonyms:
12-Isobutyl-8,13-dioxo-1,7diaza-cyclotridecane-2,11-dicarboxylic acid 11-hydroxyamide 2-methylamide | CHEMBL90337
Type:
Small organic molecule
Emp. Form.:
C18H32N4O5
Mol. Mass.:
384.4705
SMILES:
CNC(=O)[C@@H]1CCCCNC(=O)CC[C@@H]([C@@H](CC(C)C)C(=O)N1)C(=O)NO
: