Target
Adenosine transporter 1
Ligand
BDBM50105139
Substrate
Meas. Tech.
ChEMBL_149711 (CHEMBL755808)
Ki
2400±n/a nM
Citation
 Klenke, BStewart, MBarrett, MPBrun, RGilbert, IH Synthesis and biological evaluation of s-triazine substituted polyamines as potential new anti-trypanosomal drugs. J Med Chem 44:3440-52 (2001)  
Target
Name:
Adenosine transporter 1
Synonyms:
Type:
PROTEIN
Mol. Mass.:
51044.02
Organism:
Trypanosoma brucei
Description:
ChEMBL_31141
Residue:
463
  
Inhibitor
Name:
BDBM50105139
Synonyms:
CHEMBL544580 | N1,N9-Di(3-(((4,6-(dimethylamino-1,3,5-triazin-2-yl)methyl)amino)propyl)-1,12dodecanediamine Heptachloride
Type:
Small organic molecule
Emp. Form.:
C42H78N24
Mol. Mass.:
919.2295
SMILES:
CNc1nc(CN(CCCNCCCCCCCCCCCCNCCCN(Cc2nc(NC)nc(NC)n2)Cc2nc(NC)nc(NC)n2)Cc2nc(NC)nc(NC)n2)nc(NC)n1
: