Target
Neprilysin
Ligand
BDBM50105261
Substrate
Meas. Tech.
ChEMBL_144640 (CHEMBL752997)
Ki
2±n/a nM
Citation
 Chen, HNoble, FRoques, BPFournié-Zaluski, MC Long lasting antinociceptive properties of enkephalin degrading enzyme (NEP and APN) inhibitor prodrugs. J Med Chem 44:3523-30 (2001)  
Target
Name:
Neprilysin
Synonyms:
Atriopeptidase CD_antigen=CD10 EPN MME NEP_HUMAN Neutral endopeptidase | Neutral endopeptidase 24.11
Type:
Enzyme
Mol. Mass.:
85505.38
Organism:
Homo sapiens (Human)
Description:
P08473
Residue:
750
  
Inhibitor
Name:
BDBM50105261
Synonyms:
1-[2-(1-Benzyloxycarbonyl-2-phenyl-ethylcarbamoyl)-3-phenyl-propyldisulfanylmethyl]-3-methylsulfanyl-propyl-ammonium | benzyl 2-[(2S)-2-({[(2S)-2-azaniumyl-4-(methylsulfanyl)butyl]disulfanyl}methyl)-3-phenylpropanamido]-3-phenylpropanoate
Type:
Small organic molecule
Emp. Form.:
C31H39N2O3S3
Mol. Mass.:
583.847
SMILES:
CSCC[C@H]([NH3+])CSSC[C@@H](Cc1ccccc1)C(=O)NC(Cc1ccccc1)C(=O)OCc1ccccc1
: