Target
5-hydroxytryptamine receptor 1F
Ligand
BDBM50106484
Substrate
Meas. Tech.
ChEMBL_2083 (CHEMBL616726)
Ki
3.8±n/a nM
Citation
 Xu, YCJohnson, KWPhebus, LACohen, MNelson, DLSchenck, KWalker, CDFritz, JEKaldor, SWLeTourneau, MEMurff, REZgombick, JMCalligaro, DOAudia, JESchaus, JM N-[3-(2-Dimethylaminoethyl)-2-methyl-1H- indol-5-yl]-4-fluorobenzamide: a potent, selective, and orally active 5-HT(1F) receptor agonist potentially useful for migraine therapy. J Med Chem 44:4031-4 (2001)  
Target
Name:
5-hydroxytryptamine receptor 1F
Synonyms:
5-HT-1F 5-hydroxytryptamine receptor 1F HTR1EL Serotonin (5-HT) receptor Serotonin receptor 1F
Type:
Enzyme Catalytic Domain
Mol. Mass.:
41724.68
Organism:
Homo sapiens (Human)
Description:
5-HT1F HTR1F HUMAN::P30939
Residue:
366
  
Inhibitor
Name:
BDBM50106484
Synonyms:
CHEMBL421287 | N-[3-(2-Dimethylamino-ethyl)-1H-indol-4-yl]-4-fluoro-benzamide
Type:
Small organic molecule
Emp. Form.:
C19H20FN3O
Mol. Mass.:
325.38
SMILES:
CN(C)CCc1c[nH]c2cccc(NC(=O)c3ccc(F)cc3)c12
: