Target
Adenosine receptor A2a
Ligand
BDBM50106536
Substrate
Meas. Tech.
ChEMBL_29990 (CHEMBL642178)
Ki
>10±n/a nM
Citation
 Jacobson, KAGao, ZGChen, ABarak, DKim, SALee, KLink, ARompaey, PVvan Calenbergh, SLiang, BT Neoceptor concept based on molecular complementarity in GPCRs: a mutant adenosine A(3) receptor with selectively enhanced affinity for amine-modified nucleosides. J Med Chem 44:4125-36 (2001)  
Target
Name:
Adenosine receptor A2a
Synonyms:
AA2AR_RAT Adenosine A2 receptor Adenosine Receptors A2a (A2a) Adenosine receptors A2a Rat striatal adenosine A2a receptor
Type:
G Protein-Coupled Receptor (GPCR)
Mol. Mass.:
45015.65
Organism:
Rattus norvegicus (rat)
Description:
Rat A2A receptors expressed in CHO cells.
Residue:
410
  
Inhibitor
Name:
BDBM50106536
Synonyms:
2'-AMINO-2'-DEOXYADENOSINE 4-Amino-5-(6-amino-purin-9-yl)-2-hydroxymethyl-tetrahydro-furan-3-ol cid_100053
Type:
Small organic molecule
Emp. Form.:
C10H14N6O3
Mol. Mass.:
266.2566
SMILES:
N[C@@H]1[C@H](O)[C@@H](CO)O[C@H]1n1cnc2c(N)ncnc12
: