Target
Adenosine receptor A3
Ligand
BDBM50067116
Substrate
Meas. Tech.
ChEMBL_31833 (CHEMBL641335)
Ki
61.7±n/a nM
Citation
 Jacobson, KAGao, ZGChen, ABarak, DKim, SALee, KLink, ARompaey, PVvan Calenbergh, SLiang, BT Neoceptor concept based on molecular complementarity in GPCRs: a mutant adenosine A(3) receptor with selectively enhanced affinity for amine-modified nucleosides. J Med Chem 44:4125-36 (2001)  
Target
Name:
Adenosine receptor A3
Synonyms:
A3 adenosine receptor (hA3) ADORA3 | Adenosine A3 receptor (A3AR)
Type:
G Protein-Coupled Receptor (GPCR)
Mol. Mass.:
36197.32
Organism:
Homo sapiens (Human)
Description:
P0DMS8
Residue:
318
  
Inhibitor
Name:
BDBM50067116
Synonyms:
4-Methoxy-N-(3-pyridin-2-yl-isoquinolin-1-yl)-benzamide CHEMBL128929 | VUF-8504
Type:
Small organic molecule
Emp. Form.:
C22H17N3O2
Mol. Mass.:
355.3893
SMILES:
COc1ccc(cc1)C(=O)Nc1nc(cc2ccccc12)-c1ccccn1
: