Target
Tyrosine-protein phosphatase non-receptor type 2
Ligand
BDBM50107739
Substrate
Meas. Tech.
ChEMBL_206164 (CHEMBL872634)
IC50
4600±n/a nM
Citation
 Jia, ZYe, QDinaut, ANWang, QWaddleton, DPayette, PRamachandran, CKennedy, BHum, GTaylor, SD Structure of protein tyrosine phosphatase 1B in complex with inhibitors bearing two phosphotyrosine mimetics. J Med Chem 44:4584-94 (2001)  
Target
Name:
Tyrosine-protein phosphatase non-receptor type 2
Synonyms:
PTN2_HUMAN PTPT T-cell protein-tyrosine phosphatase TCPTP Tyrosine-protein phosphatase non-receptor type 2 (TC-PTP)
Type:
Protein
Mol. Mass.:
48481.80
Organism:
Homo sapiens (Human)
Description:
P17706
Residue:
415
  
Inhibitor
Name:
BDBM50107739
Synonyms:
CHEMBL140954 | [(4-{4-[4-(Difluoro-phosphono-methyl)-benzyloxy]-phenoxymethyl}-phenyl)-difluoro-methyl]-phosphonic acid
Type:
Small organic molecule
Emp. Form.:
C22H20F4O8P2
Mol. Mass.:
550.3305
SMILES:
OP(O)(=O)C(F)(F)c1ccc(COc2ccc(OCc3ccc(cc3)C(F)(F)P(O)(O)=O)cc2)cc1
: