Target
Gonadotropin-releasing hormone receptor
Ligand
BDBM50102456
Substrate
Meas. Tech.
ChEMBL_71451 (CHEMBL684350)
IC50
6.8±n/a nM
Citation
 Jiang, GStalewski, JGalyean, RDykert, JSchteingart, CBroqua, PAebi, AAubert, MLSemple, GRobson, PAkinsanya, KHaigh, RRiviere, PTrojnar, JJunien, JLRivier, JE GnRH antagonists: a new generation of long acting analogues incorporating p-ureido-phenylalanines at positions 5 and 6. J Med Chem 44:453-67 (2001)  
Target
Name:
Gonadotropin-releasing hormone receptor
Synonyms:
GNRHR GRHR GnRH-R Gonadotropin-releasing hormone receptor | Gonadotropin-releasing hormone receptor (GnRH)
Type:
Enzyme
Mol. Mass.:
37749.45
Organism:
Homo sapiens (Human)
Description:
P30968
Residue:
328
  
Inhibitor
Name:
BDBM50102456
Synonyms:
Ac-D-Nal-[D-(pCl)Phe]-D-Pal-Ser-[Aph(Ac)]-D-[Aph(Ac)]-Leu-ILys-Pro-DAla-NH2 acyline
Type:
Small organic molecule
Emp. Form.:
C80H102ClN15O14
Mol. Mass.:
1533.211
SMILES:
CC(C)C[C@H](NC(=O)[C@@H](Cc1ccc(NC(C)=O)cc1)NC(=O)[C@H](Cc1ccc(NC(C)=O)cc1)NC(=O)[C@H](CO)NC(=O)[C@@H](Cc1cccnc1)NC(=O)[C@@H](Cc1ccc(Cl)cc1)NC(=O)[C@@H](Cc1ccc2ccccc2c1)NC(C)=O)C(=O)N[C@@H](CCCCNC(C)C)C(=O)N1CCC[C@H]1C(=O)N[C@H](C)C(N)=O
: