Target
Gonadotropin-releasing hormone receptor
Ligand
BDBM50102459
Substrate
Meas. Tech.
ChEMBL_71601 (CHEMBL689133)
Kd
1.58±n/a nM
Citation
 Jiang, GStalewski, JGalyean, RDykert, JSchteingart, CBroqua, PAebi, AAubert, MLSemple, GRobson, PAkinsanya, KHaigh, RRiviere, PTrojnar, JJunien, JLRivier, JE GnRH antagonists: a new generation of long acting analogues incorporating p-ureido-phenylalanines at positions 5 and 6. J Med Chem 44:453-67 (2001)  
Target
Name:
Gonadotropin-releasing hormone receptor
Synonyms:
GNRHR GRHR GnRH-R Gonadotropin-releasing hormone receptor | Gonadotropin-releasing hormone receptor (GnRH)
Type:
Enzyme
Mol. Mass.:
37749.45
Organism:
Homo sapiens (Human)
Description:
P30968
Residue:
328
  
Inhibitor
Name:
BDBM50102459
Synonyms:
Ac-D-Nal-[D-(pCl)Phe]-D-Pal-Ser-[Aph(DHor)]-D-[Amf(Ac)]-Leu-ILys-Pro-DAla-NH2 | CHEMBL415573
Type:
Small organic molecule
Emp. Form.:
C84H106ClN17O16
Mol. Mass.:
1645.298
SMILES:
CC(C)C[C@H](NC(=O)[C@@H](Cc1ccc(CNC(C)=O)cc1)NC(=O)[C@H](Cc1ccc(NC(=O)[C@@H]2CC(=O)NC(=O)N2)cc1)NC(=O)[C@H](CO)NC(=O)[C@@H](Cc1cccnc1)NC(=O)[C@@H](Cc1ccc(Cl)cc1)NC(=O)[C@@H](Cc1ccc2ccccc2c1)NC(C)=O)C(=O)N[C@@H](CCCCNC(C)C)C(=O)N1CCC[C@H]1C(=O)N[C@H](C)C(N)=O
: