Target
Gonadotropin-releasing hormone receptor
Ligand
BDBM50102437
Substrate
Meas. Tech.
ChEMBL_71601 (CHEMBL689133)
Kd
0.631±n/a nM
Citation
 Jiang, GStalewski, JGalyean, RDykert, JSchteingart, CBroqua, PAebi, AAubert, MLSemple, GRobson, PAkinsanya, KHaigh, RRiviere, PTrojnar, JJunien, JLRivier, JE GnRH antagonists: a new generation of long acting analogues incorporating p-ureido-phenylalanines at positions 5 and 6. J Med Chem 44:453-67 (2001)  
Target
Name:
Gonadotropin-releasing hormone receptor
Synonyms:
GNRHR GRHR GnRH-R Gonadotropin-releasing hormone receptor | Gonadotropin-releasing hormone receptor (GnRH)
Type:
Enzyme
Mol. Mass.:
37749.45
Organism:
Homo sapiens (Human)
Description:
P30968
Residue:
328
  
Inhibitor
Name:
BDBM50102437
Synonyms:
Ac-D-Nal-[D-(pCl)Phe]-D-Pal-Ser-[Aph(Hor)]-D-[Amf(Cbm)]-Leu-ILys-Pro-NHEt | CHEMBL412336
Type:
Small organic molecule
Emp. Form.:
C82H104ClN17O15
Mol. Mass.:
1603.261
SMILES:
CCNC(=O)[C@@H]1CCCN1C(=O)[C@H](CCCCNC(C)C)NC(=O)[C@H](CC(C)C)NC(=O)[C@@H](Cc1ccc(CNC(N)=O)cc1)NC(=O)[C@H](Cc1ccc(NC(=O)[C@H]2CC(=O)NC(=O)N2)cc1)NC(=O)[C@H](CO)NC(=O)[C@@H](Cc1cccnc1)NC(=O)[C@@H](Cc1ccc(Cl)cc1)NC(=O)[C@@H](Cc1ccc2ccccc2c1)NC(C)=O
: