Target
Macrophage migration inhibitory factor
Ligand
BDBM50096003
Substrate
Meas. Tech.
ChEMBL_103899 (CHEMBL711481)
Ki
470±n/a nM
Citation
 Orita, MYamamoto, SKatayama, NAoki, MTakayama, KYamagiwa, YSeki, NSuzuki, HKurihara, HSakashita, HTakeuchi, MFujita, SYamada, TTanaka, A Coumarin and chromen-4-one analogues as tautomerase inhibitors of macrophage migration inhibitory factor: discovery and X-ray crystallography. J Med Chem 44:540-7 (2001)  
Target
Name:
Macrophage migration inhibitory factor
Synonyms:
GIF Glycosylation-inhibiting factor L-dopachrome tautomerase MIF/CD74 (Macrophage migration inhibitory factor and HLA-DR antigens-associated invariant chain) MMIF Macrophage migration inhibitory factor (MIF) | Phenylpyruvate tautomerase
Type:
Enzyme
Mol. Mass.:
12478.18
Organism:
Homo sapiens (Human)
Description:
P14174
Residue:
115
  
Inhibitor
Name:
BDBM50096003
Synonyms:
7-Hydroxy-3-phenyl-chromen-2-one CHEMBL153505 | cid_5393176
Type:
Small organic molecule
Emp. Form.:
C15H10O3
Mol. Mass.:
238.2381
SMILES:
Oc1ccc2cc(-c3ccccc3)c(=O)oc2c1
: