Target
Adenosine receptor A2a
Ligand
BDBM50207816
Substrate
Meas. Tech.
ChEMBL_30024 (CHEMBL641315)
Ki
63±n/a nM
Citation
 van Muijlwijk-Koezen, JETimmerman, HVollinga, RCFrijtag von Drabbe Künzel, Jde Groote, MVisser, SIJzerman, AP Thiazole and thiadiazole analogues as a novel class of adenosine receptor antagonists. J Med Chem 44:749-62 (2001)  
Target
Name:
Adenosine receptor A2a
Synonyms:
AA2AR_RAT Adenosine A2 receptor Adenosine Receptors A2a (A2a) Adenosine receptors A2a Rat striatal adenosine A2a receptor
Type:
G Protein-Coupled Receptor (GPCR)
Mol. Mass.:
45015.65
Organism:
Rattus norvegicus (rat)
Description:
Rat A2A receptors expressed in CHO cells.
Residue:
410
  
Inhibitor
Name:
BDBM50207816
Synonyms:
CHEMBL273094 N-(2-Amino-ethyl)-2-[4-(2,6-dioxo-1,3-dipropyl-2,3,6,7-tetrahydro-1H-purin-8-yl)-phenoxy]-acetamide (xanthine amine congenere, XAC) N-(2-Amino-ethyl)-2-[4-(2,6-dioxo-1,3-dipropyl-2,3,6,9-tetrahydro-1H-purin-8-yl)-phenoxy]-acetamide XAC
Type:
Small organic molecule
Emp. Form.:
C21H28N6O4
Mol. Mass.:
428.4848
SMILES:
CCCn1c2nc([nH]c2c(=O)n(CCC)c1=O)-c1ccc(OCC(=O)NCCN)cc1
: