Target
Prothrombin
Ligand
BDBM50098230
Substrate
Meas. Tech.
ChEMBL_210587 (CHEMBL817553)
Ki
6.5±n/a nM
Citation
 Pierce, ACJorgensen, WL Estimation of binding affinities for selective thrombin inhibitors via Monte Carlo simulations. J Med Chem 44:1043-50 (2001)  
Target
Name:
Prothrombin
Synonyms:
Activation peptide fragment 1 Coagulation factor II Prothrombin Thrombin Thrombin light chain
Type:
Enzyme
Mol. Mass.:
70502.73
Organism:
Bos taurus (Bovine)
Description:
P00735
Residue:
625
  
Inhibitor
Name:
BDBM50098230
Synonyms:
CHEMBL9491 | N-[1-(4-Diaminomethyl-benzyl)-2-oxo-2-piperidin-1-yl-ethyl]-2-(naphthalene-2-sulfonylamino)-acetamide
Type:
Small organic molecule
Emp. Form.:
C27H33N5O4S
Mol. Mass.:
523.647
SMILES:
NC(N)c1ccc(C[C@@H](NC(=O)CNS(=O)(=O)c2ccc3ccccc3c2)C(=O)N2CCCCC2)cc1
: