Target
Chymase
Ligand
BDBM50098843
Substrate
Meas. Tech.
ChEMBL_197663 (CHEMBL872602)
Ki
43.5±n/a nM
Citation
 Akahoshi, FAshimori, ASakashita, HYoshimura, TImada, TNakajima, MMitsutomi, NKuwahara, SOhtsuka, TFukaya, CMiyazaki, MNakamura, N Synthesis, structure-activity relationships, and pharmacokinetic profiles of nonpeptidic alpha-keto heterocycles as novel inhibitors of human chymase. J Med Chem 44:1286-96 (2001)  
Target
Name:
Chymase
Synonyms:
Alpha-chymase CMA1_HUMAN CYM Mast cell protease I
Type:
Enzyme
Mol. Mass.:
27340.12
Organism:
Homo sapiens (Human)
Description:
Residue:
247
  
Inhibitor
Name:
BDBM50098843
Synonyms:
2-{2-[2-(5-Amino-6-oxo-2-pyridin-4-yl-6H-pyrimidin-1-yl)-acetylamino]-3-phenyl-propionyl}-benzooxazole-5-carboxylic acid methyl ester | CHEMBL23999
Type:
Small organic molecule
Emp. Form.:
C29H24N6O6
Mol. Mass.:
552.5375
SMILES:
COC(=O)c1ccc2oc(nc2c1)C(=O)C(Cc1ccccc1)NC(=O)Cn1c(ncc(N)c1=O)-c1ccncc1
: