Target
Chymase
Ligand
BDBM50098859
Substrate
Meas. Tech.
ChEMBL_197663 (CHEMBL872602)
Ki
2120±n/a nM
Citation
 Akahoshi, FAshimori, ASakashita, HYoshimura, TImada, TNakajima, MMitsutomi, NKuwahara, SOhtsuka, TFukaya, CMiyazaki, MNakamura, N Synthesis, structure-activity relationships, and pharmacokinetic profiles of nonpeptidic alpha-keto heterocycles as novel inhibitors of human chymase. J Med Chem 44:1286-96 (2001)  
Target
Name:
Chymase
Synonyms:
Alpha-chymase CMA1_HUMAN CYM Mast cell protease I
Type:
Enzyme
Mol. Mass.:
27340.12
Organism:
Homo sapiens (Human)
Description:
Residue:
247
  
Inhibitor
Name:
BDBM50098859
Synonyms:
2-[5-Amino-2-(4-fluoro-phenyl)-6-oxo-6H-pyrimidin-1-yl]-N-[1-benzyl-2-(5-hydroxy-benzooxazol-2-yl)-2-oxo-ethyl]-acetamide | CHEMBL432467
Type:
Small organic molecule
Emp. Form.:
C28H22FN5O5
Mol. Mass.:
527.5032
SMILES:
Nc1cnc(-c2ccc(F)cc2)n(CC(=O)NC(Cc2ccccc2)C(=O)c2nc3cc(O)ccc3o2)c1=O
: