Target
Vesicular glutamate transporter 3
Ligand
BDBM50113313
Substrate
Meas. Tech.
ChEMBL_213566 (CHEMBL816123)
Ki
190000±n/a nM
Citation
 Carrigan, CNBartlett, RDEsslinger, CSCybulski, KATongcharoensirikul, PBridges, RJThompson, CM Synthesis and in vitro pharmacology of substituted quinoline-2,4-dicarboxylic acids as inhibitors of vesicular glutamate transport. J Med Chem 45:2260-76 (2002)  
Target
Name:
Vesicular glutamate transporter 3
Synonyms:
Slc17a8 Vglut3
Type:
PROTEIN
Mol. Mass.:
64750.88
Organism:
Rattus norvegicus
Description:
ChEMBL_213568
Residue:
588
  
Inhibitor
Name:
BDBM50113313
Synonyms:
4,8-Dihydroxy-quinoline-2-carboxylic acid anion CHEMBL312535
Type:
Small organic molecule
Emp. Form.:
C10H7NO4
Mol. Mass.:
205.1669
SMILES:
OC(=O)c1cc(O)c2cccc(O)c2n1
: