Target
Saccharopepsin
Ligand
BDBM50113847
Substrate
Meas. Tech.
ChEMBL_197598 (CHEMBL803023)
Ki
400±n/a nM
Citation
 Cozzini, PFornabaio, MMarabotti, AAbraham, DJKellogg, GEMozzarelli, A Simple, intuitive calculations of free energy of binding for protein-ligand complexes. 1. Models without explicit constrained water. J Med Chem 45:2469-83 (2002)  
Target
Name:
Saccharopepsin
Synonyms:
CARP_YEAST PHO9 Saccharopepesin
Type:
PROTEIN
Mol. Mass.:
44479.78
Organism:
Saccharomyces cerevisiae
Description:
ChEMBL_197598
Residue:
405
  
Inhibitor
Name:
BDBM50113847
Synonyms:
1H-Benzoimidazole-2-carboxylic acid {1-[1-cyclohexylmethyl-2-hydroxy-4-(2-morpholin-4-yl-ethylcarbamoyl)-hept-6-ynylcarbamoyl]-2-methylsulfanyl-ethyl}-amide | CHEMBL83697
Type:
Small organic molecule
Emp. Form.:
C33H48N6O5S
Mol. Mass.:
640.836
SMILES:
CSC[C@H](NC(=O)c1nc2ccccc2[nH]1)C(=O)N[C@@H](CC1CCCCC1)[C@@H](O)C[C@@H](CC#C)C(=O)NCCN1CCOCC1
: