Target
Melanocortin receptor 4
Ligand
BDBM50114079
Substrate
Meas. Tech.
ChEMBL_104236 (CHEMBL712742)
EC50
2.9±n/a nM
Citation
 Kavarana, MJTrivedi, DCai, MYing, JHammer, MCabello, CGrieco, PHan, GHruby, VJ Novel cyclic templates of alpha-MSH give highly selective and potent antagonists/agonists for human melanocortin-3/4 receptors. J Med Chem 45:2644-50 (2002)  
Target
Name:
Melanocortin receptor 4
Synonyms:
MC4-R MC4R_HUMAN Melanocortin receptor 4 (MC-4) Melanocortin receptor 4 (MC4R)
Type:
Enzyme
Mol. Mass.:
36949.50
Organism:
Homo sapiens (Human)
Description:
P32245
Residue:
332
  
Inhibitor
Name:
BDBM50114079
Synonyms:
15-(2-Acetylamino-hexanoylamino)-9-benzyl-6-(3-guanidino-propyl)-12-(3H-imidazol-4-ylmethyl)-3-(1H-indol-3-ylmethyl)-2,5,8,11,14,17-hexaoxo-1,4,7,10,13,18hexaaza-cyclotetracosane-24-carboxylic acid amide alpha-melanotropin-II(MT-II) peptide
Type:
Small organic molecule
Emp. Form.:
C51H71N15O9
Mol. Mass.:
1038.2045
SMILES:
CCCC[C@H](NC(C)=O)C(=O)N[C@H]1CC(=O)NCCCCC[C@H](NC(=O)[C@H](Cc2c[nH]c3ccccc23)NC(=O)[C@H](CCCNC(N)=N)NC(=O)[C@H](Cc2ccccc2)NC(=O)[C@H](Cc2c[nH]cn2)NC1=O)C(N)=O
: