Target
Melanocortin receptor 5
Ligand
BDBM50114750
Substrate
Meas. Tech.
ChEMBL_104263 (CHEMBL711700)
EC50
684±n/a nM
Citation
 Holder, JRBauzo, RMXiang, ZHaskell-Luevano, C Structure-activity relationships of the melanocortin tetrapeptide Ac-His-DPhe-Arg-Trp-NH(2) at the mouse melanocortin receptors. 1. Modifications at the His position. J Med Chem 45:2801-10 (2002)  
Target
Name:
Melanocortin receptor 5
Synonyms:
MC5R_MOUSE Melanocortin receptor 5 | Melanocortin receptor 5 (MC5R)
Type:
Enzyme
Mol. Mass.:
36966.58
Organism:
Mus musculus (Mouse)
Description:
P41149
Residue:
325
  
Inhibitor
Name:
BDBM50114750
Synonyms:
3-{2-[1-[1-[1-acetyl-(5S)-dihydro-1H-5-pyrrolylcarboxamido]-2-phenyl-(1R)-ethylcarboxamido]-4-amino(imino)methylamino-(1S)-butylcarboxamido]-2-carbamoylethyl}-1H-indole | CHEMBL320157
Type:
Small organic molecule
Emp. Form.:
C33H43N9O5
Mol. Mass.:
645.7518
SMILES:
CC(=O)N1CCC[C@H]1C(=O)N[C@H](Cc1ccccc1)C(=O)N[C@@H](CCCNC(N)=N)C(=O)N[C@@H](Cc1c[nH]c2ccccc12)C(N)=O
: