Target
Sodium/hydrogen exchanger 1
Ligand
BDBM50115243
Substrate
Meas. Tech.
ChEMBL_141044 (CHEMBL746892)
IC50
14±n/a nM
Citation
 Fukumoto, SImamiya, EKusumoto, KFujiwara, SWatanabe, TShiraishi, M Novel, non-acylguanidine-type Na(+)/H(+) exchanger inhibitors: synthesis and pharmacology of 5-tetrahydroquinolinylidene aminoguanidine derivatives. J Med Chem 45:3009-21 (2002)  
Target
Name:
Sodium/hydrogen exchanger 1
Synonyms:
NHE-1 Nhe1 Slc9a1 | Solute carrier family 9 member 1
Type:
PROTEIN
Mol. Mass.:
91655.00
Organism:
Rattus norvegicus
Description:
ChEMBL_862370
Residue:
820
  
Inhibitor
Name:
BDBM50115243
Synonyms:
(S)-N-[7-(5-fluoro-2-methylphenyl)-4-methyl-(7S)-5,6,7,8-tetrahydro-5-quinolinyliden(imine)]iminomethanediamine 2CH3SO3H | CHEMBL102872
Type:
Small organic molecule
Emp. Form.:
C18H20FN5
Mol. Mass.:
325.3833
SMILES:
[#6]-c1ccc(F)cc1-[#6@H]-1-[#6]-[#6](=[#7]\[#7]=[#6](\[#7])-[#7])-c2c(-[#6])ccnc2-[#6]-1
: