Target
Melanocortin receptor 3
Ligand
BDBM50115362
Substrate
Meas. Tech.
ChEMBL_106849 (CHEMBL714836)
Kd
295.12±n/a nM
Citation
 Holder, JRBauzo, RMXiang, ZHaskell-Luevano, C Structure-activity relationships of the melanocortin tetrapeptide Ac-His-DPhe-Arg-Trp-NH(2) at the mouse melanocortin receptors: part 2 modifications at the Phe position. J Med Chem 45:3073-81 (2002)  
Target
Name:
Melanocortin receptor 3
Synonyms:
MC3-R Mc3r
Type:
PROTEIN
Mol. Mass.:
35808.24
Organism:
Mus musculus
Description:
ChEMBL_1498848
Residue:
323
  
Inhibitor
Name:
BDBM50115362
Synonyms:
2-{2-[2-Acetylamino-3-(3H-imidazol-4-yl)-propionylamino]-3-naphthalen-2-yl-propionylamino}-5-guanidino-pentanoic acid [1-carbamoyl-2-(1H-indol-3-yl)-ethyl]-amide | CHEMBL103817
Type:
Small organic molecule
Emp. Form.:
C38H45N11O5
Mol. Mass.:
735.8346
SMILES:
CC(=O)N[C@@H](Cc1cnc[nH]1)C(=O)N[C@H](Cc1ccc2ccccc2c1)C(=O)N[C@@H](CCCNC(N)=N)C(=O)N[C@@H](Cc1c[nH]c2ccccc12)C(N)=O
: