Target
Metabotropic glutamate receptor 4
Ligand
BDBM26431
Substrate
Meas. Tech.
ChEMBL_106687 (CHEMBL714668)
Ki
1600±n/a nM
Citation
 Bertrand, HOBessis, ASPin, JPAcher, FC Common and selective molecular determinants involved in metabotopic glutamate receptor agonist activity. J Med Chem 45:3171-83 (2002)  
Target
Name:
Metabotropic glutamate receptor 4
Synonyms:
GPRC1D GRM4_HUMAN MGLUR4 Metabotropic glutamate receptor 4 (mGlu4) metabotropic glutamate 4
Type:
Protein
Mol. Mass.:
101899.95
Organism:
Homo sapiens (Human)
Description:
Q14833
Residue:
912
  
Inhibitor
Name:
BDBM26431
Synonyms:
(2R)-2-aminopentanedioic acid D-Glu D-[14C]Glu
Type:
radiolabeled amino acid
Emp. Form.:
C5H9NO4
Mol. Mass.:
147.1293
SMILES:
N[C@H](CCC(O)=O)C(O)=O
: