Target
3-oxo-5-alpha-steroid 4-dehydrogenase 1
Ligand
BDBM50334788
Substrate
Meas. Tech.
ChEMBL_205193 (CHEMBL812008)
IC50
10±n/a nM
Citation
 Picard, FBarassin, SMokhtarian, AHartmann, RW Synthesis and evaluation of 2'-substituted 4-(4'-carboxy- or 4'-carboxymethylbenzylidene)-N-acylpiperidines: highly potent and in vivo active steroid 5alpha-reductase type 2 inhibitors. J Med Chem 45:3406-17 (2002)  
Target
Name:
3-oxo-5-alpha-steroid 4-dehydrogenase 1
Synonyms:
S5A1_RAT Steroid 5-alpha-reductase | Steroid 5-alpha-reductase 1
Type:
PROTEIN
Mol. Mass.:
29788.29
Organism:
Rattus norvegicus
Description:
ChEMBL_1441437
Residue:
259
  
Inhibitor
Name:
BDBM50334788
Synonyms:
(17beta-(N-tert-butylcarbamoyl)-4-aza-5alpha-androst-1-en-3-one (4aR,4bS,6aS,7S,9aS,9bS,11aR)-N-tert-butyl-4a,6a-dimethyl-2-oxo-2,4a,4b,5,6,6a,7,8,9,9a,9b,10,11,11a-tetradecahydro-1H-indeno[5,4-f]quinoline-7-carboxamide (4aR,6aS)-4a,6a-Dimethyl-2-oxo-2,4a,4b,5,6,6a,7,8,9,9a,9b,10,11,11a-tetradecahydro-1H-indeno[5,4-f]quinoline-7-carboxylic acid tert-butylamide (4aR,6aS,7S)-4a,6a-Dimethyl-2-oxo-2,4a,4b,5,6,6a,7,8,9,9a,9b,10,11,11a-tetradecahydro-1H-indeno[5,4-f]quinoline-7-carboxylic acid tert-butylamide (R)-4a,6a-Dimethyl-2-oxo-2,4a,4b,5,6,6a,7,8,9,9a,9b,10,11,11a-tetradecahydro-1H-indeno[5,4-f]quinoline-7-carboxylic acid tert-butylamide 4a,6a-Dimethyl-2-oxo-2,4a,4b,5,6,6a,7,8,9,9a,9b,10,11,11a-tetradecahydro-1H-indeno[5,4-f]quinoline-7-carboxylic acid tert-butylamide CHEMBL710 MK-906 Proscar | US9061023, Finasteride
Type:
Small organic molecule
Emp. Form.:
C23H36N2O2
Mol. Mass.:
372.5441
SMILES:
CC(C)(C)NC(=O)[C@H]1CC[C@H]2[C@@H]3CC[C@H]4NC(=O)C=C[C@]4(C)[C@H]3CC[C@]12C
: