Target
3-oxo-5-alpha-steroid 4-dehydrogenase 2
Ligand
BDBM50116428
Substrate
Meas. Tech.
ChEMBL_205054 (CHEMBL810248)
IC50
940±n/a nM
Citation
 Picard, FBarassin, SMokhtarian, AHartmann, RW Synthesis and evaluation of 2'-substituted 4-(4'-carboxy- or 4'-carboxymethylbenzylidene)-N-acylpiperidines: highly potent and in vivo active steroid 5alpha-reductase type 2 inhibitors. J Med Chem 45:3406-17 (2002)  
Target
Name:
3-oxo-5-alpha-steroid 4-dehydrogenase 2
Synonyms:
S5A2_RAT Steroid 5-alpha-reductase | Steroid 5-alpha-reductase 2
Type:
PROTEIN
Mol. Mass.:
28784.15
Organism:
Rattus norvegicus
Description:
ChEMBL_205054
Residue:
254
  
Inhibitor
Name:
BDBM50116428
Synonyms:
4-(1-Diphenylacetyl-piperidin-4-ylidenemethyl)-3-methoxy-benzoic acid | CHEMBL116621
Type:
Small organic molecule
Emp. Form.:
C28H27NO4
Mol. Mass.:
441.5183
SMILES:
[#6]-[#8]-c1cc(ccc1\[#6]=[#6]-1\[#6]-[#6]-[#7](-[#6]-[#6]-1)-[#6](=O)-[#6](-c1ccccc1)-c1ccccc1)-[#6](-[#8])=O
: