Target
Adenosine receptor A2a
Ligand
BDBM50041598
Substrate
Meas. Tech.
ChEMBL_32152 (CHEMBL646279)
Ki
290±n/a nM
Citation
 Müller, CEThorand, MQurishi, RDiekmann, MJacobson, KAPadgett, WLDaly, JW Imidazo[2,1-i]purin-5-ones and related tricyclic water-soluble purine derivatives: potent A(2A)- and A(3)-adenosine receptor antagonists. J Med Chem 45:3440-50 (2002)  
Target
Name:
Adenosine receptor A2a
Synonyms:
AA2AR_RAT Adenosine A2 receptor Adenosine Receptors A2a (A2a) Adenosine receptors A2a Rat striatal adenosine A2a receptor
Type:
G Protein-Coupled Receptor (GPCR)
Mol. Mass.:
45015.65
Organism:
Rattus norvegicus (rat)
Description:
Rat A2A receptors expressed in CHO cells.
Residue:
410
  
Inhibitor
Name:
BDBM50041598
Synonyms:
1,3-Dimethyl-8-((E)-styryl)-3,7-dihydro-purine-2,6-dione CHEMBL282993
Type:
Small organic molecule
Emp. Form.:
C15H14N4O2
Mol. Mass.:
282.2973
SMILES:
Cn1c2nc(C=Cc3ccccc3)[nH]c2c(=O)n(C)c1=O
: