Target
Leukotriene A-4 hydrolase
Ligand
BDBM50116538
Substrate
Meas. Tech.
ChEMBL_90046 (CHEMBL701917)
IC50
49±n/a nM
Citation
 Penning, TDRussell, MAChen, BBChen, HYLiang, CDMahoney, MWMalecha, JWMiyashiro, JMYu, SSAskonas, LJGierse, JKHarding, EIHighkin, MKKachur, JFKim, SHVillani-Price, DPyla, EYGhoreishi-Haack, NSSmith, WG Synthesis of potent leukotriene A(4) hydrolase inhibitors. Identification of 3-[methyl[3-[4-(phenylmethyl)phenoxy]propyl]amino]propanoic acid. J Med Chem 45:3482-90 (2002)  
Target
Name:
Leukotriene A-4 hydrolase
Synonyms:
LKHA4_HUMAN LTA4 Leukotriene A(4) hydrolase Leukotriene A4 hydrolase
Type:
Hydrolase; metalloprotease
Mol. Mass.:
69280.41
Organism:
Homo sapiens (Human)
Description:
Human recombinant LTA4H.
Residue:
611
  
Inhibitor
Name:
BDBM50116538
Synonyms:
3-{[3-(4-Benzyl-phenoxy)-propyl]-methyl-amino}-propionic acid; hydrochloride CHEMBL543405 | SC-57461A
Type:
Small organic molecule
Emp. Form.:
C20H25NO3
Mol. Mass.:
327.4174
SMILES:
CN(CCCOc1ccc(Cc2ccccc2)cc1)CCC(O)=O
: