Target
Platelet-derived growth factor receptor beta
Ligand
BDBM50117337
Substrate
Meas. Tech.
ChEMBL_158651 (CHEMBL763437)
IC50
2±n/a nM
Citation
 Pandey, AVolkots, DLSeroogy, JMRose, JWYu, JCLambing, JLHutchaleelaha, AHollenbach, SJAbe, KGiese, NAScarborough, RM Identification of orally active, potent, and selective 4-piperazinylquinazolines as antagonists of the platelet-derived growth factor receptor tyrosine kinase family. J Med Chem 45:3772-93 (2002)  
Target
Name:
Platelet-derived growth factor receptor beta
Synonyms:
Beta-type platelet-derived growth factor receptor CD140b antigen PDGF Receptor Substrate PDGFR PDGFR-1 PDGFRB PGFRB_HUMAN Platelet-derived growth factor receptor 1 Platelet-derived growth factor receptor beta (PDGFR-beta) Platelet-derived growth factor receptor beta (PDGFRbeta) | VHL/PDGFRB
Type:
Enzyme
Mol. Mass.:
123922.25
Organism:
Homo sapiens (Human)
Description:
P09619
Residue:
1106
  
Inhibitor
Name:
BDBM50117337
Synonyms:
4-[7-(2-Methoxy-ethoxy)-quinazolin-4-yl]-piperazine-1-carboxylic acid [4-(1H-indol-5-yloxy)-phenyl]-amide | CHEMBL121829
Type:
Small organic molecule
Emp. Form.:
C30H30N6O4
Mol. Mass.:
538.597
SMILES:
COCCOc1ccc2c(ncnc2c1)N1CCN(CC1)C(=O)Nc1ccc(Oc2ccc3[nH]ccc3c2)cc1
: