Target
Mast/stem cell growth factor receptor Kit
Ligand
BDBM50117314
Substrate
Meas. Tech.
ChEBML_158683
IC50
16±n/a nM
Citation
 Pandey, AVolkots, DLSeroogy, JMRose, JWYu, JCLambing, JLHutchaleelaha, AHollenbach, SJAbe, KGiese, NAScarborough, RM Identification of orally active, potent, and selective 4-piperazinylquinazolines as antagonists of the platelet-derived growth factor receptor tyrosine kinase family. J Med Chem 45:3772-93 (2002)  
Target
Name:
Mast/stem cell growth factor receptor Kit
Synonyms:
CD117 antigen KIT Mast/stem cell growth factor receptor Kit (cKIT) Proto-oncogene tyrosine-protein kinase Kit Stem cell growth factor receptor Tyrosine-protein kinase Kit c-kit v-kit Hardy-Zuckerman 4 feline sarcoma viral oncogene homolog
Type:
Protein
Mol. Mass.:
109869.37
Organism:
Homo sapiens (Human)
Description:
P10721
Residue:
976
  
Inhibitor
Name:
BDBM50117314
Synonyms:
4-{6-Methoxy-7-[3-(2-methyl-piperidin-1-yl)-propoxy]-quinazolin-4-yl}-piperazine-1-carboxylic acid (4-isopropoxy-phenyl)-amide | CHEMBL107599
Type:
Small organic molecule
Emp. Form.:
C32H44N6O4
Mol. Mass.:
576.7296
SMILES:
COc1cc2c(ncnc2cc1OCCCN1CCCCC1C)N1CCN(CC1)C(=O)Nc1ccc(OC(C)C)cc1
: