Target
Neuromedin-K receptor
Ligand
BDBM50118098
Substrate
Meas. Tech.
ChEMBL_209569 (CHEMBL811271)
Ki
39±n/a nM
Citation
 Albert, JSAharony, DAndisik, DBarthlow, HBernstein, PRBialecki, RADedinas, RDembofsky, BTHill, DKirkland, KKoether, GMKosmider, BJOhnmacht, CPalmer, WPotts, WRumsey, WShen, LShenvi, ASherwood, SWarwick, PJRussell, K Design, synthesis, and SAR of tachykinin antagonists: modulation of balance in NK(1)/NK(2) receptor antagonist activity. J Med Chem 45:3972-83 (2002)  
Target
Name:
Neuromedin-K receptor
Synonyms:
NK-3 receptor NK3R NKR Neurokinin B receptor Neuromedin-3 receptor (NK-3R) Neuromedin-K receptor Neuromedin-K receptor (NK3) TAC3R Tachykinin receptor 3 | Tachykinin receptor 3 (NK3)
Type:
Enzyme
Mol. Mass.:
52221.96
Organism:
Homo sapiens (Human)
Description:
P29371
Residue:
465
  
Inhibitor
Name:
BDBM50118098
Synonyms:
(S)-3-Cyano-naphthalene-1-carboxylic acid {2-(3,4-dichloro-phenyl)-4-[4-(2-methanesulfinyl-4-methoxy-phenyl)-piperidin-1-yl]-butyl}-methyl-amide | CHEMBL340326
Type:
Small organic molecule
Emp. Form.:
C36H37Cl2N3O3S
Mol. Mass.:
662.668
SMILES:
COc1ccc(C2CCN(CC[C@H](CN(C)C(=O)c3cc(cc4ccccc34)C#N)c3ccc(Cl)c(Cl)c3)CC2)c(c1)[S@](C)=O
: