Target
P2Y purinoceptor 1
Ligand
BDBM50118232
Substrate
Meas. Tech.
ChEMBL_147717 (CHEMBL759187)
EC50
8±n/a nM
Citation
 Jacobson, KAJarvis, MFWilliams, M Purine and pyrimidine (P2) receptors as drug targets. J Med Chem 45:4057-93 (2002)  
Target
Name:
P2Y purinoceptor 1
Synonyms:
P2RY1 | P2RY1_MELGA
Type:
Mol. Mass.:
41199.64
Organism:
Meleagris gallopavo
Description:
Residue:
362
  
Inhibitor
Name:
BDBM50118232
Synonyms:
2-MeSATP CHEMBL336208
Type:
Small organic molecule
Emp. Form.:
C11H18N5O13P3S
Mol. Mass.:
553.273
SMILES:
CSc1nc(N)c2ncn([C@@H]3O[C@H](COP(O)(=O)OP(O)(=O)OP(O)(O)=O)[C@@H](O)[C@H]3O)c2n1
: