Target
P2X purinoceptor 1
Ligand
BDBM50370141
Substrate
Meas. Tech.
ChEMBL_149728 (CHEMBL759511)
EC50
6±n/a nM
Citation
 Jacobson, KAJarvis, MFWilliams, M Purine and pyrimidine (P2) receptors as drug targets. J Med Chem 45:4057-93 (2002)  
Target
Name:
P2X purinoceptor 1
Synonyms:
ATP receptor P2RX1_HUMAN Purinergic receptor | Purinergic, P2X
Type:
Enzyme Catalytic Domain
Mol. Mass.:
44992.65
Organism:
Homo sapiens (Human)
Description:
Purinergic, P2X 0 HUMAN::P51575
Residue:
399
  
Inhibitor
Name:
BDBM50370141
Synonyms:
TNP-ATP
Type:
Small organic molecule
Emp. Form.:
C16H16N8O19P3
Mol. Mass.:
717.2623
SMILES:
Nc1ncnc2n(cnc12)C1OC(COP(O)(=O)OP(O)(=O)OP(O)(O)=O)C2OC3(OC12)C(=C[C-](C=C3[N+]([O-])=O)[N+]([O-])=O)[N+]([O-])=O
: